BDBM50043295 (1-Benzo[b]thiophen-2-yl-cyclohexyl)-propyl-amine::CHEMBL340059
SMILES CCCNC1(CCCCC1)c1cc2ccccc2s1
InChI Key InChIKey=ZTPIVFSAHJOUHQ-UHFFFAOYSA-N
Data  3 IC50
  Tab Delimited (TSV)   2D SDfile   Computed 3D by Vconf -m prep SDfile
Find this compound or compounds like it in BindingDB:
Activity Spreadsheet -- Enzyme Inhibition Constant Data from BindingDB
Found 3 hits for monomerid = 50043295
TargetSodium-dependent dopamine transporter(Rattus norvegicus (rat))
National Institute Of Diabetes And Digestive And Kidney Diseases
Curated by ChEMBL
LigandPNGBDBM50043295((1-Benzo[b]thiophen-2-yl-cyclohexyl)-propyl-amine ...)
Affinity DataIC50:  5nM. Assay description: Tested for inhibition of radioligand [3H]dopamine (DA) uptake in rat synaptosomes
In DepthDetails ArticlePubMed
TargetSodium-dependent dopamine transporter(Rattus norvegicus (rat))
National Institute Of Diabetes And Digestive And Kidney Diseases
Curated by ChEMBL
LigandPNGBDBM50043295((1-Benzo[b]thiophen-2-yl-cyclohexyl)-propyl-amine ...)
Affinity DataIC50:  57nM. Assay description: Tested for radioligand [3H]cocaine displacement from dopamine transporter in rat forebrain
In DepthDetails ArticlePubMed
TargetSodium-dependent dopamine transporter(Rattus norvegicus (rat))
National Institute Of Diabetes And Digestive And Kidney Diseases
Curated by ChEMBL
LigandPNGBDBM50043295((1-Benzo[b]thiophen-2-yl-cyclohexyl)-propyl-amine ...)
Affinity DataIC50:  4nM. Assay description: Tested for radioligand [3H]BTCP displacement from dopamine transporter in rat forebrain
In DepthDetails ArticlePubMed