BDBM50043322 CHEMBL427748::c(Cys-Ser-c(Cys-Ser-Ser-Leu-Met-Asp-Lys-Gln-Cys)-Val-Tyr-Phe-Cys)-His-Leu-Asp-Leu-Ile-Trp
SMILES CC[C@H](C)[C@H](NC(=O)[C@H](CC(C)C)NC(=O)[C@H](CC(O)=O)NC(=O)[C@H](CC(C)C)NC(=O)[C@H](Cc1cnc[nH]1)NC(=O)[C@@H]1CSSC[C@@H](N)C(=O)N[C@@H](CO)C(=O)N[C@@H]2CSSC[C@@H](NC(=O)[C@H](CCC(O)=O)NC(=O)[C@@H](CCCCN)NC(=O)[C@H](CC(O)=O)NC(=O)[C@@H](CCSC)NC(=O)[C@H](CC(C)C)NC(=O)[C@@H](CO)NC(=O)[C@H](CO)NC2=O)C(=O)N[C@@H](C(C)C)C(=O)N[C@H](Cc2ccc(O)cc2)C(=O)N[C@@H](Cc2ccccc2)C(=O)N1)C(=O)N[C@@H](Cc1c[nH]c2ccccc12)C(O)=O
InChI Key InChIKey=IWBJVHLORHQTIZ-XHAWGJKBSA-N
Data  2 IC50
  Tab Delimited (TSV)   2D SDfile   Computed 3D by Vconf -m prep SDfile
Find this compound or compounds like it in BindingDB:
Activity Spreadsheet -- Enzyme Inhibition Constant Data from BindingDB
Found 2 hits for monomerid = 50043322
TargetEndothelin-1 receptor(Sus scrofa)
Takeda Chemical Industries
Curated by ChEMBL
LigandPNGBDBM50043322(CHEMBL427748 | c(Cys-Ser-c(Cys-Ser-Ser-Leu-Met-Asp...)
Affinity DataIC50:  0.75nM. Assay description: Tested for the competitive binding versus [125I]- ET-1 determined in porcine cardiac ventricular membrane for Endothelin A receptor
In DepthDetails ArticlePubMed
TargetEndothelin receptor type B(Bos taurus)
Takeda Chemical Industries
Curated by ChEMBL
LigandPNGBDBM50043322(CHEMBL427748 | c(Cys-Ser-c(Cys-Ser-Ser-Leu-Met-Asp...)
Affinity DataIC50:  0.170nM. Assay description: Tested for the competitive binding versus [125I]- ET-1 determined in bovine cerebrum membrane for Endothelin B receptor
In DepthDetails ArticlePubMed