BDBM50043388 CHEMBL3355075
SMILES C[C@@H]1Cn2ncc(C3CCN(CC3)S(C)(=O)=O)c2CN1c1ccnc2[nH]ncc12
InChI Key
Data  1 IC50
  Tab Delimited (TSV)   2D SDfile   Computed 3D by Vconf -m prep SDfile
Find this compound or compounds like it in BindingDB:
Activity Spreadsheet -- Enzyme Inhibition Constant Data from BindingDB
Found 1 hit for monomerid = 50043388
TargetSerine/threonine-protein kinase ATR(Homo sapiens (Human))
Novartis Institutes For Biomedical Research
Curated by ChEMBL
LigandPNGBDBM50043388(CHEMBL3355075)
Affinity DataIC50:  29nM. Assay description: Inhibition of ATR (unknown origin) using Avi-tagged protein substrate by alphascreen assay
In DepthDetails ArticlePubMed