BDBM50043432 4,5-Dichloro-2-[5-(2-ethyl-5,7-dimethyl-3H-imidazo[4,5-b]pyridin-4-ylmethyl)-2,3-dihydro-indole-1-carbonyl]-benzoic acid::CHEMBL134567
SMILES CCc1nc2c(C)cc(C)nc2n1Cc1ccc2N(Cc3cc(Cl)c(Cl)cc3C(O)=O)CCc2c1
InChI Key InChIKey=ARXVLQLBRUNRKP-UHFFFAOYSA-N
Data  2 IC50
  Tab Delimited (TSV)   2D SDfile   Computed 3D by Vconf -m prep SDfile
Find this compound or compounds like it in BindingDB:
Activity Spreadsheet -- Enzyme Inhibition Constant Data from BindingDB
Found 2 hits for monomerid = 50043432
TargetType-2 angiotensin II receptor(RAT)
Merck Research Laboratories
Curated by ChEMBL
LigandPNGBDBM50043432(4,5-Dichloro-2-[5-(2-ethyl-5,7-dimethyl-3H-imidazo...)
Affinity DataIC50:  1.00E+3nM. Assay description: In vitro antagonist activity against angiotensin II receptor type 2 in rat midbrain using [125I]-Sar,Ile AII.
In DepthDetails ArticlePubMed
TargetType-1 angiotensin II receptor(RABBIT)
Merck Research Laboratories
Curated by ChEMBL
LigandPNGBDBM50043432(4,5-Dichloro-2-[5-(2-ethyl-5,7-dimethyl-3H-imidazo...)
Affinity DataIC50:  170nM. Assay description: In vitro antagonist activity against angiotensin II receptor type 1 in rabbit aorta using [125I]-Sar, Ile AII.
In DepthDetails ArticlePubMed