BDBM50043457 CHEMBL135346::{Ethyl-[4-(2-ethyl-5,7-dimethyl-imidazo[4,5-b]pyridin-3-ylmethyl)-phenyl]-amino}-phenyl-acetic acid
SMILES CCN(C(C(O)=O)c1ccccc1)c1ccc(Cn2c(CC)nc3c(C)cc(C)nc23)cc1
InChI Key InChIKey=PFOYNRHXNOJZBY-UHFFFAOYSA-N
Data  2 IC50
  Tab Delimited (TSV)   2D SDfile   Computed 3D by Vconf -m prep SDfile
Find this compound or compounds like it in BindingDB:
Activity Spreadsheet -- Enzyme Inhibition Constant Data from BindingDB
Found 2 hits for monomerid = 50043457
TargetType-2 angiotensin II receptor(RAT)
Merck Research Laboratories
Curated by ChEMBL
LigandPNGBDBM50043457(CHEMBL135346 | {Ethyl-[4-(2-ethyl-5,7-dimethyl-imi...)
Affinity DataIC50:  740nM. Assay description: In vitro antagonist activity against angiotensin II type 2 (AT2) receptor in rat midbrain using [125I]- Sar, Ile AII.
In DepthDetails ArticlePubMed
TargetType-1 angiotensin II receptor(RABBIT)
Merck Research Laboratories
Curated by ChEMBL
LigandPNGBDBM50043457(CHEMBL135346 | {Ethyl-[4-(2-ethyl-5,7-dimethyl-imi...)
Affinity DataIC50:  4nM. Assay description: In vitro antagonist activity against angiotensin II receptor type 1 in rabbit aorta using [125I]-Sar, Ile AII.
In DepthDetails ArticlePubMed