BDBM50043588 1N-[1-phenyl-(1S)-ethyl]-2-[1-[1-amino-(1R)-ethylcarboxamido]-2-(1H-3-indolyl)-(1S)-ethylcarboxamido]-4-methyl-(2S)-pentanamide::CHEMBL336419
SMILES CC(C)C[C@H](NC(=O)[C@H](Cc1c[nH]c2ccccc12)NC(=O)[C@@H](C)N)C(=O)N[C@@H](C)c1ccccc1
InChI Key InChIKey=QZPAQYPSRXIPQS-DRTRNHDVSA-N
Data  2 IC50
  Tab Delimited (TSV)   2D SDfile   Computed 3D by Vconf -m prep SDfile
Find this compound or compounds like it in BindingDB:
Activity Spreadsheet -- Enzyme Inhibition Constant Data from BindingDB
Found 2 hits for monomerid = 50043588
TargetInterstitial collagenase(Homo sapiens (Human))
Merck Research Laboratories
Curated by ChEMBL
LigandPNGBDBM50043588(1N-[1-phenyl-(1S)-ethyl]-2-[1-[1-amino-(1R)-ethylc...)
Affinity DataIC50:  7.50E+3nM. Assay description: Inhibition of human fibroblast collagenase
In DepthDetails ArticlePubMed
TargetStromelysin-1(Homo sapiens (Human))
Merck Research Laboratories
Curated by ChEMBL
LigandPNGBDBM50043588(1N-[1-phenyl-(1S)-ethyl]-2-[1-[1-amino-(1R)-ethylc...)
Affinity DataIC50:  1.20E+4nM. Assay description: Inhibition of human fibroblast stromelysin
In DepthDetails ArticlePubMed