BDBM50043634 CHEMBL3355519
SMILES Clc1ccccc1-n1c2nccn2c2nc(Nc3ccccc3)ncc2c1=O
InChI Key InChIKey=LOVNSZMZEXLULX-UHFFFAOYSA-N
Data  1 KI  1 EC50
  Tab Delimited (TSV)   2D SDfile   Computed 3D by Vconf -m prep SDfile
Find this compound or compounds like it in BindingDB:
Activity Spreadsheet -- Enzyme Inhibition Constant Data from BindingDB
Found 2 hits for monomerid = 50043634
TargetWee1-like protein kinase(Homo sapiens (Human))
Abbvie
Curated by ChEMBL
LigandPNGBDBM50043634(CHEMBL3355519)
Affinity DataKi:  21nM. Assay description: Inhibition of GST-tagged human Wee1
In DepthDetails ArticlePubMed
TargetWee1-like protein kinase(Homo sapiens (Human))
Abbvie
Curated by ChEMBL
LigandPNGBDBM50043634(CHEMBL3355519)
Affinity DataEC50:  6.80E+3nM. Assay description: Inhibition of human Weel1 in human NCI-H1299 cells assessed as phosphorylation of Cdk1 after overnight incubation by ELISA PD assay
In DepthDetails ArticlePubMed