BDBM50043746 ((R)-1-{(R)-1-[(S)-2-(4-Methoxy-phenyl)-1-methylcarbamoyl-ethylcarbamoyl]-3-methyl-butylamino}-propyl)-phosphonic acid::CHEMBL297670
SMILES CC[C@H](N[C@H](CC(C)C)C(=O)N[C@@H](Cc1ccc(OC)cc1)C(=O)NC)P(O)(O)=O
InChI Key InChIKey=WKAFHMQHWQPVLN-FGTMMUONSA-N
Data  1 IC50
  Tab Delimited (TSV)   2D SDfile   Computed 3D by Vconf -m prep SDfile
Find this compound or compounds like it in BindingDB:
Activity Spreadsheet -- Enzyme Inhibition Constant Data from BindingDB
Found 1 hit for monomerid = 50043746
TargetInterstitial collagenase(Homo sapiens (Human))
Smithkline Beecham Pharmaceuticals
Curated by ChEMBL
LigandPNGBDBM50043746(((R)-1-{(R)-1-[(S)-2-(4-Methoxy-phenyl)-1-methylca...)
Affinity DataIC50:  1.56E+4nM. Assay description: Inhibition of degradation of radiolabeled rat skin type I collagen by semipurified human lung fibroblast collagenase
In DepthDetails ArticlePubMed