BDBM50043766 CHEMBL3356009
SMILES Cc1ccc2c(NS(=O)(=O)c3ccccc3Cl)cccc2c1Oc1ncccc1-c1ccnc(N[C@H]2CCCNC2)n1
InChI Key InChIKey=XMWUCMFVDXDRDE-NRFANRHFSA-N
Data  2 IC50
PDB links: 1 PDB ID matches this monomer.
  Tab Delimited (TSV)   2D SDfile   Computed 3D by Vconf -m prep SDfile
Find this compound or compounds like it in BindingDB:
Activity Spreadsheet -- Enzyme Inhibition Constant Data from BindingDB
Found 2 hits for monomerid = 50043766
TargetMitogen-activated protein kinase 10(Homo sapiens (Human))
Amgen
Curated by ChEMBL
LigandPNGBDBM50043766(CHEMBL3356009)
Affinity DataIC50:  2.50E+3nM. Assay description: Inhibition of human wild type JNK3 using biotinylated ATF2 substrate assessed as phosphorylation at thr53 on ATF2 by fluorescent plate reader
In DepthDetails ArticlePubMed
TargetSerine/threonine-protein kinase/endoribonuclease IRE1(Homo sapiens (Human))
Amgen
Curated by ChEMBL
LigandPNGBDBM50043766(CHEMBL3356009)
Affinity DataIC50:  13nM. Assay description: Inhibition of human IRE1alpha using 5'[6FAM]-GAGUCCGCAGCACUC-[BHQ1]3' substrate by biochemical fluorescence quenching assay