BDBM50043789 3-Tetrazol-2-yl-nonan-2-ol::CHEMBL65627
SMILES CCCCCCC(C(C)O)n1ncnn1
InChI Key InChIKey=ZQGUUEXJCPWYAQ-UHFFFAOYSA-N
Data  2 KI
  Tab Delimited (TSV)   2D SDfile   Computed 3D by Vconf -m prep SDfile
Find this compound or compounds like it in BindingDB:
Activity Spreadsheet -- Enzyme Inhibition Constant Data from BindingDB
Found 2 hits for monomerid = 50043789
TargetAdenosine deaminase(Bos taurus (bovine))
Universit£
Curated by ChEMBL
LigandPNGBDBM50043789(3-Tetrazol-2-yl-nonan-2-ol | CHEMBL65627)
Affinity DataKi:  9.60E+3nM. Assay description: In vitro innhibition of adenosine deaminase isolated from calf intestine.
In DepthDetails ArticlePubMed
TargetAdenosine deaminase(Bos taurus (bovine))
Universit£
Curated by ChEMBL
LigandPNGBDBM50043789(3-Tetrazol-2-yl-nonan-2-ol | CHEMBL65627)
Affinity DataKi:  9.60E+3nM. Assay description: In vitro innhibition of adenosine deaminase isolated from calf intestine.
In DepthDetails ArticlePubMed