BDBM50043797 (R)-2-Benzyloxycarbonylamino-3-(4-hydroxy-phenyl)-propionic acid::CHEMBL305478::Cbz-D-Tyr
SMILES OC(=O)[C@@H](Cc1ccc(O)cc1)NC(=O)OCc1ccccc1
InChI Key InChIKey=MCRMUCXATQAAMN-OAHLLOKOSA-N
Data  2 KI  2 IC50  1 ITC
  Tab Delimited (TSV)   2D SDfile   Computed 3D by Vconf -m prep SDfile
Find this compound or compounds like it in BindingDB:
Activity Spreadsheet -- Enzyme Inhibition Constant Data from BindingDB
Found 4 hits for monomerid = 50043797
TargetStromelysin-1(Homo sapiens (Human))
Warner-Lambert
Curated by ChEMBL
LigandPNGBDBM50043797((R)-2-Benzyloxycarbonylamino-3-(4-hydroxy-phenyl)-...)
Affinity DataKi:  3.56E+5nM. Assay description: Inhibition of recombinant stromelysin catalytic domain (SCD)
In DepthDetails ArticlePubMed
TargetStromelysin-1(Homo sapiens (Human))
Warner-Lambert
Curated by ChEMBL
LigandPNGBDBM50043797((R)-2-Benzyloxycarbonylamino-3-(4-hydroxy-phenyl)-...)
Affinity DataKi:  3.77E+5nM. Assay description: Inhibition of recombinant full length stromelysin (FLS)
In DepthDetails ArticlePubMed
TargetStromelysin-1(Homo sapiens (Human))
Warner-Lambert
Curated by ChEMBL
LigandPNGBDBM50043797((R)-2-Benzyloxycarbonylamino-3-(4-hydroxy-phenyl)-...)
Affinity DataIC50:  4.50E+5nM. Assay description: Inhibition of recombinant full length stromelysin (FLS).
In DepthDetails ArticlePubMed
TargetStromelysin-1(Homo sapiens (Human))
Warner-Lambert
Curated by ChEMBL
LigandPNGBDBM50043797((R)-2-Benzyloxycarbonylamino-3-(4-hydroxy-phenyl)-...)
Affinity DataIC50:  4.32E+5nM. Assay description: In vitro inhibition of recombinant stromelysin catalytic domain.
In DepthDetails ArticlePubMed
Activity Spreadsheet -- ITC Data from BindingDB
Found 1 hit for monomerid = 50043797
HostPNGBDBM36126(gamma-cyclodextrin)
Japan Science And Technology Agency
GuestPNGBDBM50043797((R)-2-Benzyloxycarbonylamino-3-(4-hydroxy-phenyl)-...)
ITC DataΔG°: -3.06kcal/mole −TΔS°: 1.53kcal/mole ΔH°: -4.59kcal/mole logk: 175
pH: 6.9 T: 25.00°C