BDBM50043914 (2-Oxo-6-sulfamoyl-2,3-dihydro-1H-thieno[2,3-b][1,4]thiazin-3-yl)-acetic acid::CHEMBL312006
SMILES NS(=O)(=O)c1cc2NC(=O)C(CC(O)=O)Sc2s1
InChI Key InChIKey=AXDJORCIGPLOSD-UHFFFAOYSA-N
Data  1 KI
  Tab Delimited (TSV)   2D SDfile   Computed 3D by Vconf -m prep SDfile
Find this compound or compounds like it in BindingDB:
Activity Spreadsheet -- Enzyme Inhibition Constant Data from BindingDB
Found 1 hit for monomerid = 50043914
TargetCarbonic anhydrase 2(Homo sapiens (Human))
Merck Research Laboratories
Curated by ChEMBL
LigandPNGBDBM50043914((2-Oxo-6-sulfamoyl-2,3-dihydro-1H-thieno[2,3-b][1,...)
Affinity DataKi:  48nM. Assay description: Tested for ability to compete with dansylamide for binding to human erythrocyte carbonic-anhydrase-II (HCA-II)
In DepthDetails ArticlePubMed