BDBM50043941 CHEMBL3356014
SMILES Nc1n[nH]c2cc(ccc12)-c1ccc(NS(=O)(=O)C2CC2)cc1
InChI Key InChIKey=SIOZRRKLXCSWOF-UHFFFAOYSA-N
Data  1 IC50
  Tab Delimited (TSV)   2D SDfile   Computed 3D by Vconf -m prep SDfile
Find this compound or compounds like it in BindingDB:
Activity Spreadsheet -- Enzyme Inhibition Constant Data from BindingDB
Found 1 hit for monomerid = 50043941
TargetSerine/threonine-protein kinase Sgk1(Homo sapiens (Human))
Sanofi R & D
Curated by ChEMBL
LigandPNGBDBM50043941(CHEMBL3356014)
Affinity DataIC50:  1.80E+3nM. Assay description: Inhibition of human SGK1 using fluo-5(6)-carboxyfluorescein)-RPRAATF-NH2 fluorescently labeled peptide by substrate phosphorylation assay in presence...
In DepthDetails ArticlePubMed