BDBM50043971 CHEMBL88146::N-Ethyl-N'-(3-ethyl-phenyl)-N'-methyl-N-naphthalen-1-yl-guanidine
SMILES CCN(C(=N)N(C)c1cccc(CC)c1)c1cccc2ccccc12
InChI Key InChIKey=CTSFWEVBPPLUNL-UHFFFAOYSA-N
Data  1 IC50
  Tab Delimited (TSV)   2D SDfile   Computed 3D by Vconf -m prep SDfile
Find this compound or compounds like it in BindingDB:
Activity Spreadsheet -- Enzyme Inhibition Constant Data from BindingDB
Found 1 hit for monomerid = 50043971
TargetSigma non-opioid intracellular receptor 1(Homo sapiens (Human))
Cambridge Neuroscience
Curated by ChEMBL
LigandPNGBDBM50043971(CHEMBL88146 | N-Ethyl-N'-(3-ethyl-phenyl)-N'-methy...)
Affinity DataIC50:  2.29E+3nM. Assay description: Tested in vitro for the concentration required to inhibit specific [3H]-DTG radioligand binding to sigma receptor on guinea pig brain membrane
In DepthDetails ArticlePubMed