BDBM50043996 9H-Fluorene-9-carboxylic acid [3-(2,6-dimethyl-piperidin-1-yl)-propyl]-amide::CHEMBL91288
SMILES CC1CCCC(C)N1CCCNC(=O)C1c2ccccc2-c2ccccc12
InChI Key InChIKey=PVFCGXGQBWTWHW-UHFFFAOYSA-N
Data  1 IC50
  Tab Delimited (TSV)   2D SDfile   Computed 3D by Vconf -m prep SDfile
Find this compound or compounds like it in BindingDB:
Activity Spreadsheet -- Enzyme Inhibition Constant Data from BindingDB
Found 1 hit for monomerid = 50043996
TargetSodium channel protein type 2 subunit alpha(Rattus norvegicus)
Warner-Lambert
Curated by ChEMBL
LigandPNGBDBM50043996(9H-Fluorene-9-carboxylic acid [3-(2,6-dimethyl-pip...)
Affinity DataIC50:  2.90E+4nM. Assay description: Inhibition of veratridine-induced Na+ influx in chinese hamster ovary cells expressing alpha subunit of rat brain type voltage-gated sodium channel t...
In DepthDetails ArticlePubMed