BDBM50044000 2,2-Bis-(4-bromo-phenyl)-N-[3-(2,6-dimethyl-piperidin-1-yl)-propyl]-acetamide::CHEMBL92977
SMILES CC1CCCC(C)N1CCCNC(=O)C(c1ccc(Br)cc1)c1ccc(Br)cc1
InChI Key InChIKey=UGOMNHAPORMLNW-UHFFFAOYSA-N
Data  1 IC50
  Tab Delimited (TSV)   2D SDfile   Computed 3D by Vconf -m prep SDfile
Find this compound or compounds like it in BindingDB:
Activity Spreadsheet -- Enzyme Inhibition Constant Data from BindingDB
Found 1 hit for monomerid = 50044000
TargetSodium channel protein type 2 subunit alpha(Rattus norvegicus)
Warner-Lambert
Curated by ChEMBL
LigandPNGBDBM50044000(2,2-Bis-(4-bromo-phenyl)-N-[3-(2,6-dimethyl-piperi...)
Affinity DataIC50:  5.70E+3nM. Assay description: Inhibition of veratridine-induced Na+ influx in chinese hamster ovary cells expressing alpha subunit of rat brain type voltage-gated sodium channel t...
In DepthDetails ArticlePubMed