BDBM50044022 (S)-3-[(S)-2-[(S)-2-Acetylamino-3-(1H-indol-3-yl)-propionylamino]-6-(3-o-tolyl-ureido)-hexanoylamino]-N-((S)-1-carbamoyl-2-phenyl-ethyl)-N-methyl-succinamic acid::(S)-3-[(S)-2-[2-Acetylamino-3-(1H-indol-3-yl)-propionylamino]-6-(3-o-tolyl-ureido)-hexanoylamino]-N-((S)-1-carbamoyl-2-phenyl-ethyl)-N-methyl-succinamic acid::CHEMBL319438
SMILES CN([C@@H](Cc1ccccc1)C(N)=O)C(=O)[C@H](CC(O)=O)NC(=O)[C@H](CCCCNC(=O)Nc1ccccc1C)NC(=O)[C@H](Cc1c[nH]c2ccccc12)NC(C)=O
InChI Key InChIKey=XFWHGYUORWRMIN-BBACVFHCSA-N
Data  4 IC50
  Tab Delimited (TSV)   2D SDfile   Computed 3D by Vconf -m prep SDfile
Find this compound or compounds like it in BindingDB:
Activity Spreadsheet -- Enzyme Inhibition Constant Data from BindingDB
Found 4 hits for monomerid = 50044022
TargetCholecystokinin receptor type A(Cavia porcellus)
Abbott Laboratories
Curated by ChEMBL
LigandPNGBDBM50044022((S)-3-[(S)-2-[(S)-2-Acetylamino-3-(1H-indol-3-yl)-...)
Affinity DataIC50:  4.80nM. Assay description: Inhibition of [125I]Bolton-Hunter CCK-8 binding to cholecystokinin type A receptor in guinea pig pancreas
In DepthDetails ArticlePubMed
TargetCholecystokinin receptor type A(Homo sapiens (Human))
Glaxo Research Institute
Curated by ChEMBL
LigandPNGBDBM50044022((S)-3-[(S)-2-[(S)-2-Acetylamino-3-(1H-indol-3-yl)-...)
Affinity DataIC50:  20nM. Assay description: In vitro displacement of [125I]BH-CCK-8 from cDNA of human Cholecystokinin type A receptor expressed in CHO-K1 cells
In DepthDetails ArticlePubMed
TargetGastrin/cholecystokinin type B receptor(Homo sapiens (Human))
Glaxo Research Institute
Curated by ChEMBL
LigandPNGBDBM50044022((S)-3-[(S)-2-[(S)-2-Acetylamino-3-(1H-indol-3-yl)-...)
Affinity DataIC50:  5.01E+3nM. Assay description: In vitro displacement of [125I]BH-CCK-8 from cDNA of human Cholecystokinin type B receptor expressed in CHO-K1 cells
In DepthDetails ArticlePubMed
TargetGastrin/cholecystokinin type B receptor(Homo sapiens (Human))
Glaxo Research Institute
Curated by ChEMBL
LigandPNGBDBM50044022((S)-3-[(S)-2-[(S)-2-Acetylamino-3-(1H-indol-3-yl)-...)
Affinity DataIC50:  6.40E+3nM. Assay description: Concentration required to inhibit 50% of specific binding to Cholecystokinin type B receptor in guinea pig cortex using [125I]Bolton-Hunter CCK-8
In DepthDetails ArticlePubMed