BDBM50044054 CHEMBL107720::N-(2-Amino-ethyl)-N'-[2-(3,4-dichloro-phenyl)-ethyl]-ethane-1,2-diamine
SMILES NCCNCCNCCc1ccc(Cl)c(Cl)c1
InChI Key InChIKey=QPPJXTHRTYRJPM-UHFFFAOYSA-N
Data  1 KI
  Tab Delimited (TSV)   2D SDfile   Computed 3D by Vconf -m prep SDfile
Find this compound or compounds like it in BindingDB:
Activity Spreadsheet -- Enzyme Inhibition Constant Data from BindingDB
Found 1 hit for monomerid = 50044054
TargetSigma non-opioid intracellular receptor 1(Homo sapiens (Human))
National Institutes Of Diabetes And Digestive And Kidney Diseases
Curated by ChEMBL
LigandPNGBDBM50044054(CHEMBL107720 | N-(2-Amino-ethyl)-N'-[2-(3,4-dichlo...)
Affinity DataKi:  243nM. Assay description: Binding affinity towards sigma 1 receptor was determined in guinea pig brain membrane using [3H](+)-pentazocine as radioligand
In DepthDetails ArticlePubMed