BDBM50044085 CHEMBL3356065
SMILES C[C@H]1CN(CCN1C(=O)Cc1ccccc1)c1ncnc2[nH]cc(C)c12
InChI Key
Data  1 IC50
  Tab Delimited (TSV)   2D SDfile   Computed 3D by Vconf -m prep SDfile
Find this compound or compounds like it in BindingDB:
Activity Spreadsheet -- Enzyme Inhibition Constant Data from BindingDB
Found 1 hit for monomerid = 50044085
TargetLIM domain kinase 2(Homo sapiens (Human))
Lexicon Pharmaceuticals
Curated by ChEMBL
LigandPNGBDBM50044085(CHEMBL3356065)
Affinity DataIC50:  660nM. Assay description: Inhibition of human full-length LIMK2 assessed as incorporation of P33 from ATP into biotinylated-cofilin substrate by scintillation counting analysi...
In DepthDetails ArticlePubMed