BDBM50044182 CHEMBL3313999
SMILES CC(C)n1ccc[n+]1-c1ccc(cc1C(C)(C)C)-c1cc(C(=O)N[C@H]2C[C@@H](C2)C(O)=O)c(C)n1CC1CCCCC1
InChI Key InChIKey=LVBBQMPLAOCUDM-MCZWQBSQSA-O
Data  1 EC50
  Tab Delimited (TSV)   2D SDfile   Computed 3D by Vconf -m prep SDfile
Find this compound or compounds like it in BindingDB:
Activity Spreadsheet -- Enzyme Inhibition Constant Data from BindingDB
Found 1 hit for monomerid = 50044182
TargetNuclear receptor ROR-gamma(Homo sapiens (Human))
Genentech
Curated by ChEMBL
LigandPNGBDBM50044182(CHEMBL3313999)
Affinity DataEC50:  13nM. Assay description: Agonist activity at RoRc-LBD (unknown origin) expressed in HEK293 cells assessed as transcriptional activity by GAL4 reporter assay
In DepthDetails ArticlePubMed