BDBM50044356 5-Butyl-2-phenethyl-4-[2'-(1H-tetrazol-5-yl)-biphenyl-4-ylmethyl]-2,4-dihydro-[1,2,4]triazol-3-one::5-Butyl-2-phenethyl-4-[2'-(2H-tetrazol-5-yl)-biphenyl-4-ylmethyl]-2,4-dihydro-[1,2,4]triazol-3-one::CHEMBL313371
SMILES CCCCc1nn(CCc2ccccc2)c(=O)n1Cc1ccc(cc1)-c1ccccc1-c1nnn[nH]1
InChI Key InChIKey=KOGDEEKMGBZZPT-UHFFFAOYSA-N
Data  4 IC50
  Tab Delimited (TSV)   2D SDfile   Computed 3D by Vconf -m prep SDfile
Find this compound or compounds like it in BindingDB:
Activity Spreadsheet -- Enzyme Inhibition Constant Data from BindingDB
Found 4 hits for monomerid = 50044356
TargetType-1 angiotensin II receptor(RABBIT)
Merck Research Laboratories
Curated by ChEMBL
LigandPNGBDBM50044356(5-Butyl-2-phenethyl-4-[2'-(1H-tetrazol-5-yl)-biphe...)
Affinity DataIC50:  0.900nM. Assay description: In vitro antagonistic activity for angiotensin II receptor, type 1 by displacing 125I[Sar, ILe8 ]AII radioligand in rabbit aorta membrane without usi...
In DepthDetails ArticlePubMed
LigandPNGBDBM50044356(5-Butyl-2-phenethyl-4-[2'-(1H-tetrazol-5-yl)-biphe...)
Affinity DataIC50:  3.10nM. Assay description: Displacement of [125I]-angiotensin 2 from angiotensin AT1 receptor in Rattus norvegicus (rat) uterine membranes
In DepthDetails Article
LigandPNGBDBM50044356(5-Butyl-2-phenethyl-4-[2'-(1H-tetrazol-5-yl)-biphe...)
Affinity DataIC50:  3.10nM. Assay description: Displacement of [125I]-angiotensin 2 from angiotensin AT1 receptor in Rattus norvegicus (rat) uterine membranes
In DepthDetails Article
TargetType-1 angiotensin II receptor B(RAT)
Searle R&D
Curated by ChEMBL
LigandPNGBDBM50044356(5-Butyl-2-phenethyl-4-[2'-(1H-tetrazol-5-yl)-biphe...)
Affinity DataIC50:  3.10nM. Assay description: Inhibition of [125I]-angiotensin-II binding to the angiotensin II receptor type 1 in rat uterine membranes
In DepthDetails ArticlePubMed