BDBM50044367 5-Butyl-2-hexyl-4-[2'-(1H-tetrazol-5-yl)-biphenyl-4-ylmethyl]-2,4-dihydro-[1,2,4]triazol-3-one::CHEMBL68760
SMILES CCCCCCn1nc(CCCC)n(Cc2ccc(cc2)-c2ccccc2-c2nnn[nH]2)c1=O
InChI Key InChIKey=KOKLHTAATCAYDT-UHFFFAOYSA-N
Data  3 IC50
  Tab Delimited (TSV)   2D SDfile   Computed 3D by Vconf -m prep SDfile
Find this compound or compounds like it in BindingDB:
Activity Spreadsheet -- Enzyme Inhibition Constant Data from BindingDB
Found 3 hits for monomerid = 50044367
TargetType-1 angiotensin II receptor B(RAT)
Searle R&D
Curated by ChEMBL
LigandPNGBDBM50044367(5-Butyl-2-hexyl-4-[2'-(1H-tetrazol-5-yl)-biphenyl-...)
Affinity DataIC50:  8.70nM. Assay description: Inhibition of [125I]-angiotensin-II binding to the angiotensin II receptor type 1 in rat uterine membranes
In DepthDetails ArticlePubMed
LigandPNGBDBM50044367(5-Butyl-2-hexyl-4-[2'-(1H-tetrazol-5-yl)-biphenyl-...)
Affinity DataIC50:  8.70nM. Assay description: Displacement of [125I]-angiotensin 2 from angiotensin AT1 receptor in Rattus norvegicus (rat) uterine membranes
In DepthDetails Article
LigandPNGBDBM50044367(5-Butyl-2-hexyl-4-[2'-(1H-tetrazol-5-yl)-biphenyl-...)
Affinity DataIC50:  8.70nM. Assay description: Displacement of [125I]-angiotensin 2 from angiotensin AT1 receptor in Rattus norvegicus (rat) uterine membranes
In DepthDetails Article