BDBM50044370 5-Butyl-2-[2-(2,5-dimethoxy-phenyl)-2-hydroxy-ethyl]-4-[2'-(1H-tetrazol-5-yl)-biphenyl-4-ylmethyl]-2,4-dihydro-[1,2,4]triazol-3-one::CHEMBL304600
SMILES CCCCc1nn(CC(O)c2cc(OC)ccc2OC)c(=O)n1Cc1ccc(cc1)-c1ccccc1-c1nnn[nH]1
InChI Key InChIKey=QAPCRIYVOZRBKE-UHFFFAOYSA-N
Data  3 IC50
  Tab Delimited (TSV)   2D SDfile   Computed 3D by Vconf -m prep SDfile
Find this compound or compounds like it in BindingDB:
Activity Spreadsheet -- Enzyme Inhibition Constant Data from BindingDB
Found 3 hits for monomerid = 50044370
TargetType-1 angiotensin II receptor B(RAT)
Searle R&D
Curated by ChEMBL
LigandPNGBDBM50044370(5-Butyl-2-[2-(2,5-dimethoxy-phenyl)-2-hydroxy-ethy...)
Affinity DataIC50:  22nM. Assay description: Inhibition of [125I]-angiotensin-II binding to the angiotensin II receptor type 1 in rat uterine membranes
In DepthDetails ArticlePubMed
LigandPNGBDBM50044370(5-Butyl-2-[2-(2,5-dimethoxy-phenyl)-2-hydroxy-ethy...)
Affinity DataIC50:  22nM. Assay description: Displacement of [125I]-angiotensin 2 from angiotensin AT1 receptor in Rattus norvegicus (rat) uterine membranes
In DepthDetails Article
LigandPNGBDBM50044370(5-Butyl-2-[2-(2,5-dimethoxy-phenyl)-2-hydroxy-ethy...)
Affinity DataIC50:  22nM. Assay description: Displacement of [125I]-angiotensin 2 from angiotensin AT1 receptor in Rattus norvegicus (rat) uterine membranes
In DepthDetails Article