BDBM50044381 3-[2'-(1H-Tetrazol-5-yl)-biphenyl-4-ylmethyl]-2-(2,2,2-trifluoro-ethoxy)-3H-benzoimidazole-4-carboxylic acid::CHEMBL302973
SMILES OC(=O)c1cccc2nc(OCC(F)(F)F)n(Cc3ccc(cc3)-c3ccccc3-c3nnn[nH]3)c12
InChI Key InChIKey=CAOCTFFZCLXQQI-UHFFFAOYSA-N
Data  1 IC50
  Tab Delimited (TSV)   2D SDfile   Computed 3D by Vconf -m prep SDfile
Find this compound or compounds like it in BindingDB:
Activity Spreadsheet -- Enzyme Inhibition Constant Data from BindingDB
Found 1 hit for monomerid = 50044381
TargetType-1 angiotensin II receptor(Bos taurus)
Takeda Chemical Industries
Curated by ChEMBL
LigandPNGBDBM50044381(3-[2'-(1H-Tetrazol-5-yl)-biphenyl-4-ylmethyl]-2-(2...)
Affinity DataIC50:  580nM. Assay description: Inhibition of specific binding of [125 I ] Angiotensin-II (0.2 nM) to bovine adrenal cortex
In DepthDetails ArticlePubMed