BDBM50044390 2-Methoxy-3-[2'-(1H-tetrazol-5-yl)-biphenyl-4-ylmethyl]-3H-benzoimidazole-4-carboxylic acid methyl ester::CHEMBL71038
SMILES COC(=O)c1cccc2nc(OC)n(Cc3ccc(cc3)-c3ccccc3-c3nnn[nH]3)c12
InChI Key InChIKey=KRCMFQFAEJNPQK-UHFFFAOYSA-N
Data  1 IC50
  Tab Delimited (TSV)   2D SDfile   Computed 3D by Vconf -m prep SDfile
Find this compound or compounds like it in BindingDB:
Activity Spreadsheet -- Enzyme Inhibition Constant Data from BindingDB
Found 1 hit for monomerid = 50044390
TargetType-1 angiotensin II receptor(Bos taurus)
Takeda Chemical Industries
Curated by ChEMBL
LigandPNGBDBM50044390(2-Methoxy-3-[2'-(1H-tetrazol-5-yl)-biphenyl-4-ylme...)
Affinity DataIC50:  490nM. Assay description: Inhibition of specific binding of [125 I ] Angiotensin-II (0.2 nM) to bovine adrenal cortex
In DepthDetails ArticlePubMed