BDBM50044476 5-Butyl-4-[2'-(2H-tetrazol-5-yl)-biphenyl-4-ylmethyl]-2-p-tolyl-2,4-dihydro-[1,2,4]triazol-3-one::CHEMBL86906
SMILES CCCCc1nn(-c2ccc(C)cc2)c(=O)n1Cc1ccc(cc1)-c1ccccc1-c1nnn[nH]1
InChI Key InChIKey=CNWVGLWMJZIYMP-UHFFFAOYSA-N
Data  3 IC50
  Tab Delimited (TSV)   2D SDfile   Computed 3D by Vconf -m prep SDfile
Find this compound or compounds like it in BindingDB:
Activity Spreadsheet -- Enzyme Inhibition Constant Data from BindingDB
Found 3 hits for monomerid = 50044476
TargetType-1 angiotensin II receptor(RABBIT)
Merck Research Laboratories
Curated by ChEMBL
LigandPNGBDBM50044476(5-Butyl-4-[2'-(2H-tetrazol-5-yl)-biphenyl-4-ylmeth...)
Affinity DataIC50:  16nM. Assay description: In vitro antagonistic activity for angiotensin II receptor, type 1 by displacing 125I[Sar, ILe8 ]AII radioligand in rabbit aorta membrane without usi...
In DepthDetails ArticlePubMed
TargetType-1 angiotensin II receptor(RABBIT)
Merck Research Laboratories
Curated by ChEMBL
LigandPNGBDBM50044476(5-Butyl-4-[2'-(2H-tetrazol-5-yl)-biphenyl-4-ylmeth...)
Affinity DataIC50:  16nM. Assay description: Antagonist activity at angiotensin 2 type-1 receptor in Oryctolagus cuniculus (rabbit) aorta in presence of bovine serum albumin
In DepthDetails Article
TargetType-1 angiotensin II receptor(RABBIT)
Merck Research Laboratories
Curated by ChEMBL
LigandPNGBDBM50044476(5-Butyl-4-[2'-(2H-tetrazol-5-yl)-biphenyl-4-ylmeth...)
Affinity DataIC50:  16nM. Assay description: Antagonist activity at angiotensin 2 type-1 receptor in Oryctolagus cuniculus (rabbit) aorta in presence of bovine serum albumin
In DepthDetails Article