BDBM50044527 5-Cyclopropyl-2-(2-nitro-phenyl)-4-[2'-(2H-tetrazol-5-yl)-biphenyl-4-ylmethyl]-2,4-dihydro-[1,2,4]triazol-3-one::CHEMBL86853
SMILES [O-][N+](=O)c1ccccc1-n1nc(C2CC2)n(Cc2ccc(cc2)-c2ccccc2-c2nnn[nH]2)c1=O
InChI Key InChIKey=BPWHGUFERPAUEX-UHFFFAOYSA-N
Data  1 IC50
  Tab Delimited (TSV)   2D SDfile   Computed 3D by Vconf -m prep SDfile
Find this compound or compounds like it in BindingDB:
Activity Spreadsheet -- Enzyme Inhibition Constant Data from BindingDB
Found 1 hit for monomerid = 50044527
TargetType-1 angiotensin II receptor(RABBIT)
Merck Research Laboratories
Curated by ChEMBL
LigandPNGBDBM50044527(5-Cyclopropyl-2-(2-nitro-phenyl)-4-[2'-(2H-tetrazo...)
Affinity DataIC50:  95nM. Assay description: In vitro antagonistic activity for angiotensin II receptor, type 1 by displacing 125I[Sar, ILe8 ]AII radioligand in rabbit aorta membrane without usi...
In DepthDetails ArticlePubMed