BDBM50044604 CHEMBL3329442
SMILES CNC[C@@H]1COc2ccc(cc2O1)S(=O)(=O)c1ccccc1
InChI Key InChIKey=MJRXEIRDFQZNOR-GFCCVEGCSA-N
Data  1 KI
  Tab Delimited (TSV)   2D SDfile   Computed 3D by Vconf -m prep SDfile
Find this compound or compounds like it in BindingDB:
Activity Spreadsheet -- Enzyme Inhibition Constant Data from BindingDB
Found 1 hit for monomerid = 50044604
Target5-hydroxytryptamine receptor 6(Homo sapiens (Human))
Universidad Complutense De Madrid
Curated by ChEMBL
LigandPNGBDBM50044604(CHEMBL3329442)
Affinity DataKi:  0.200nM. Assay description: Antagonist activity at human recombinant 5HT6 receptor expressed in CHO cells
In DepthDetails ArticlePubMed