BDBM50044752 CHEMBL3353956
SMILES [H][C@]1(NC(=O)[C@H](Cc2ccc(O)cc2)NC(=O)CCSSC[C@H](NC(=O)[C@H](CC(N)=O)NC(=O)[C@H](CCC(N)=O)NC1=O)C(=O)N(CC(=O)N[C@@H](CC(C)C)C(=O)NCC(N)=O)Cc1cccs1)[C@@H](C)CC
InChI Key InChIKey=HMIDMWUTPHTDKB-WRLGQHNVSA-N
Data  1 IC50  7 EC50
  Tab Delimited (TSV)   2D SDfile   Computed 3D by Vconf -m prep SDfile
Find this compound or compounds like it in BindingDB:
Activity Spreadsheet -- Enzyme Inhibition Constant Data from BindingDB
Found 8 hits for monomerid = 50044752
TargetOxytocin receptor(Homo sapiens (Human))
Ferring Research Institute
Curated by ChEMBL
LigandPNGBDBM50044752(CHEMBL3353956)
Affinity DataEC50:  0.0100nM. Assay description: Agonist activity at human oxytocin receptor expressed in CHO-K1 cells after 5 hrs by firefly luciferase reporter gene assay
In DepthDetails ArticlePubMed
TargetVasopressin V2 receptor(Homo sapiens (Human))
Ferring Research Institute
Curated by ChEMBL
LigandPNGBDBM50044752(CHEMBL3353956)
Affinity DataEC50:  57nM. Assay description: Agonist activity at human vasopressin V2 expressed in HEK293 cells after 5 hrs by firefly luciferase reporter gene assay
In DepthDetails ArticlePubMed
TargetVasopressin V1a receptor(Homo sapiens (Human))
Ferring Research Institute
Curated by ChEMBL
LigandPNGBDBM50044752(CHEMBL3353956)
Affinity DataIC50:  1.20E+3nM. Assay description: Antagonist activity at human vasopressin V1a expressed in AVP-stimulated HEK293 cells after 5 hrs by firefly luciferase reporter gene assay
In DepthDetails ArticlePubMed
TargetOxytocin receptor(Homo sapiens (Human))
Ferring Research Institute
Curated by ChEMBL
LigandPNGBDBM50044752(CHEMBL3353956)
Affinity DataEC50:  0.00700nM. Assay description: Agonist activity at human OTR expressed in CHO cells assessed as calcium mobilization measured after 30 mins by Fluo-4-AM dye based FLIPR assay
In DepthDetails ArticlePubMed
TargetVasopressin V1b receptor(Homo sapiens (Human))
Ferring Research Institute
Curated by ChEMBL
LigandPNGBDBM50044752(CHEMBL3353956)
Affinity DataEC50:  240nM. Assay description: Agonist activity at human vasopressin V1b expressed in HEK293 cells after 5 hrs by firefly luciferase reporter gene assay
In DepthDetails ArticlePubMed
TargetVasopressin V1a receptor(Homo sapiens (Human))
Ferring Research Institute
Curated by ChEMBL
LigandPNGBDBM50044752(CHEMBL3353956)
Affinity DataEC50:  75nM. Assay description: Agonist activity at human V1b receptor expressed in CHO cells assessed as calcium mobilization measured after 30 mins by Fluo-4-AM dye based FLIPR as...
In DepthDetails ArticlePubMed
TargetVasopressin V1a receptor(Homo sapiens (Human))
Ferring Research Institute
Curated by ChEMBL
LigandPNGBDBM50044752(CHEMBL3353956)
Affinity DataEC50: >100nM. Assay description: Evaluated for the binding affinity towards the Adenosine A1 receptor in cerebral cortices of Sprague-Dawley male rats using [3H]CHA as radioligand.
In DepthDetails ArticlePubMed
TargetVasopressin V1a receptor(Homo sapiens (Human))
Ferring Research Institute
Curated by ChEMBL
LigandPNGBDBM50044752(CHEMBL3353956)
Affinity DataEC50: >1.00E+4nM. Assay description: Agonist activity at human vasopressin V1a expressed in HEK293 cells after 5 hrs by firefly luciferase reporter gene assay
In DepthDetails ArticlePubMed