BDBM50044910 CHEMBL352398::Phosphoric acid bis-[5-(5-methyl-2,4-dioxo-3,4-dihydro-2H-pyrimidin-1-yl)-2,5-dihydro-furan-2-ylmethyl] ester
SMILES Cc1cn(C2OC(COP(O)(=O)OCC3OC(C=C3)n3cc(C)c(=O)[nH]c3=O)C=C2)c(=O)[nH]c1=O
InChI Key InChIKey=AFTUVCJBTTYRAU-UHFFFAOYSA-N
Data  1 EC50
  Tab Delimited (TSV)   2D SDfile   Computed 3D by Vconf -m prep SDfile
Find this compound or compounds like it in BindingDB:
Activity Spreadsheet -- Enzyme Inhibition Constant Data from BindingDB
Found 1 hit for monomerid = 50044910
TargetReverse transcriptase/RNaseH(Human immunodeficiency virus 1)
Ura Cnrs 1309
Curated by ChEMBL
LigandPNGBDBM50044910(CHEMBL352398 | Phosphoric acid bis-[5-(5-methyl-2,...)
Affinity DataEC50:  50nM. Assay description: Effective concentration that reduces HIV-induced cytopathic effect by 50% was determined by reverse transcriptase (RT) assay.
In DepthDetails ArticlePubMed