BDBM50044919 CHEMBL3311328
SMILES COc1ccc(cc1)S(=O)(=O)Nc1c(C)cc(CC2CC2)cc1C
InChI Key InChIKey=QWYZLYRHRKHYNC-UHFFFAOYSA-N
Data  1 EC50
  Tab Delimited (TSV)   2D SDfile   Computed 3D by Vconf -m prep SDfile
Find this compound or compounds like it in BindingDB:
Activity Spreadsheet -- Enzyme Inhibition Constant Data from BindingDB
Found 1 hit for monomerid = 50044919
TargetFree fatty acid receptor 4(Homo sapiens (Human))
Glaxosmithkline
Curated by ChEMBL
LigandPNGBDBM50044919(CHEMBL3311328)
Affinity DataEC50: <3.16E+4nM. Assay description: Agonist activity at human FFA4 receptor expressed in U2OS cells assessed as calcium mobilization after 24 hrs by FLIPR
In DepthDetails ArticlePubMed