BDBM50044963 6-Fluoro-2-phenyl-1H-quinolin-4-one::CHEMBL16098
SMILES Oc1cc(nc2ccc(F)cc12)-c1ccccc1
InChI Key InChIKey=YKZPWHOKZPODTO-UHFFFAOYSA-N
Data  1 IC50
  Tab Delimited (TSV)   2D SDfile   Computed 3D by Vconf -m prep SDfile
Find this compound or compounds like it in BindingDB:
Activity Spreadsheet -- Enzyme Inhibition Constant Data from BindingDB
Found 1 hit for monomerid = 50044963
TargetTubulin beta-2B chain(Bos taurus)
Institute Of Pharmaceutical Chemistry
Curated by ChEMBL
LigandPNGBDBM50044963(6-Fluoro-2-phenyl-1H-quinolin-4-one | CHEMBL16098)
Affinity DataIC50:  3.30E+3nM. Assay description: Inhibition of tubulin polymerization
In DepthDetails ArticlePubMed