BDBM50045134 CHEMBL60096::N-(4-{4-[4-(2-Oxo-3,4-dihydro-2H-quinolin-1-yl)-piperidine-1-carbonyl]-phenoxy}-butyl)-acetamide
SMILES CC(=O)NCCCCOc1ccc(cc1)C(=O)N1CCC(CC1)N1C(=O)CCc2ccccc12
InChI Key InChIKey=DVMXTWCHCARTQS-UHFFFAOYSA-N
Data  2 IC50
  Tab Delimited (TSV)   2D SDfile   Computed 3D by Vconf -m prep SDfile
Find this compound or compounds like it in BindingDB:
Activity Spreadsheet -- Enzyme Inhibition Constant Data from BindingDB
Found 2 hits for monomerid = 50045134
TargetVasopressin V2 receptor(Rattus norvegicus (Rat))
Otsuka Pharmaceutical
Curated by ChEMBL
LigandPNGBDBM50045134(CHEMBL60096 | N-(4-{4-[4-(2-Oxo-3,4-dihydro-2H-qui...)
Affinity DataIC50: >1.00E+5nM. Assay description: Ability to displace [3H]- Arginine Vasopressin (AVP) from its specific binding sites in rat liver (V2 receptor)
In DepthDetails ArticlePubMed
TargetVasopressin V1a receptor(RAT)
Otsuka Pharmaceutical
Curated by ChEMBL
LigandPNGBDBM50045134(CHEMBL60096 | N-(4-{4-[4-(2-Oxo-3,4-dihydro-2H-qui...)
Affinity DataIC50:  210nM. Assay description: Ability to displace [3H]- Arginine Vasopressin (AVP) from its specific binding sites in rat liver (V1 receptor)
In DepthDetails ArticlePubMed