BDBM50045182 1-(4-Acetyl-2-pyrrolidin-1-ylmethyl-piperazin-1-yl)-2-(3,4-dichloro-phenyl)-ethanone::CHEMBL62879
SMILES CC(=O)N1CCN(C(CN2CCCC2)C1)C(=O)Cc1ccc(Cl)c(Cl)c1
InChI Key InChIKey=IMYIXKWHJNYXNZ-UHFFFAOYSA-N
Data  1 IC50
  Tab Delimited (TSV)   2D SDfile   Computed 3D by Vconf -m prep SDfile
Find this compound or compounds like it in BindingDB:
Activity Spreadsheet -- Enzyme Inhibition Constant Data from BindingDB
Found 1 hit for monomerid = 50045182
TargetKappa-type opioid receptor(Homo sapiens (Human))
Glaxo Group Research
Curated by ChEMBL
LigandPNGBDBM50045182(1-(4-Acetyl-2-pyrrolidin-1-ylmethyl-piperazin-1-yl...)
Affinity DataIC50:  10nM. Assay description: In vitro agonist activity at kappa opioid receptor in rabbit vas deferens.
In DepthDetails ArticlePubMed