BDBM50045187 1-{4-[2-(3,4-Dichloro-phenyl)-acetyl]-3-pyrrolidin-1-ylmethyl-piperazin-1-yl}-butan-1-one::CHEMBL292724
SMILES CCCC(=O)N1CCN(C(CN2CCCC2)C1)C(=O)Cc1ccc(Cl)c(Cl)c1
InChI Key InChIKey=SSNIDNNYVUIGSX-UHFFFAOYSA-N
Data  1 IC50
  Tab Delimited (TSV)   2D SDfile   Computed 3D by Vconf -m prep SDfile
Find this compound or compounds like it in BindingDB:
Activity Spreadsheet -- Enzyme Inhibition Constant Data from BindingDB
Found 1 hit for monomerid = 50045187
TargetKappa-type opioid receptor(Homo sapiens (Human))
Glaxo Group Research
Curated by ChEMBL
LigandPNGBDBM50045187(1-{4-[2-(3,4-Dichloro-phenyl)-acetyl]-3-pyrrolidin...)
Affinity DataIC50:  60nM. Assay description: In vitro agonist activity at kappa opioid receptor in rabbit vas deferens.
In DepthDetails ArticlePubMed