BDBM50045251 3-((R)-2-Acetylamino-3-phenyl-propionylamino)-N-{(S)-1-[(S)-1-((S)-(S)-1-carboxy-2-(S)-1H-indol-3-yl-ethylcarbamoyl)-2-methyl-butylcarbamoyl]-2-methyl-butyl}-succinamic acid::Ac-D-Phe-Asp-Ile-Ile-Trp::CHEMBL315658
SMILES CC[C@H](C)[C@H](NC(=O)[C@@H](NC(=O)[C@H](CC(O)=O)NC(=O)[C@@H](Cc1ccccc1)NC(C)=O)[C@@H](C)CC)C(=O)N[C@@H](Cc1c[nH]c2ccccc12)C(O)=O
InChI Key InChIKey=XYVDWQKXXNSVGP-MGIIKFKASA-N
Data  5 IC50
  Tab Delimited (TSV)   2D SDfile   Computed 3D by Vconf -m prep SDfile
Find this compound or compounds like it in BindingDB:
Activity Spreadsheet -- Enzyme Inhibition Constant Data from BindingDB
Found 5 hits for monomerid = 50045251
TargetEndothelin receptor type B(RAT)
TBA
Curated by ChEMBL
LigandPNGBDBM50045251(3-((R)-2-Acetylamino-3-phenyl-propionylamino)-N-{(...)
Affinity DataIC50:  9.30E+3nM. Assay description: Displacement of [125I]-ET-1 from Endothelin B receptor of rat cerebellum
In DepthDetails Article
TargetEndothelin-1 receptor(Homo sapiens (Human))
TBA
Curated by ChEMBL
LigandPNGBDBM50045251(3-((R)-2-Acetylamino-3-phenyl-propionylamino)-N-{(...)
Affinity DataIC50:  9.10E+3nM. Assay description: Displacement of [125I]-ET-1 from Endothelin A receptor of rabbit renal artery vascular smooth muscle cells
In DepthDetails Article
TargetEndothelin receptor type B/1 receptor(RAT)
Warner-Lambert
Curated by ChEMBL
LigandPNGBDBM50045251(3-((R)-2-Acetylamino-3-phenyl-propionylamino)-N-{(...)
Affinity DataIC50:  2.15E+3nM. Assay description: Binding affinity against Endothelin receptor from rat heart ventricle
In DepthDetails ArticlePubMed
TargetEndothelin-1 receptor(Homo sapiens (Human))
TBA
Curated by ChEMBL
LigandPNGBDBM50045251(3-((R)-2-Acetylamino-3-phenyl-propionylamino)-N-{(...)
Affinity DataIC50:  9.10E+3nM. Assay description: Binding affinity against ET A receptor from rabbit renal artery vascular smooth muscle cells
In DepthDetails ArticlePubMed
TargetEndothelin receptor type B(RAT)
TBA
Curated by ChEMBL
LigandPNGBDBM50045251(3-((R)-2-Acetylamino-3-phenyl-propionylamino)-N-{(...)
Affinity DataIC50:  9.30E+3nM. Assay description: Effective concentration against Endothelin B receptor from rat cerebellum
In DepthDetails ArticlePubMed