BDBM50045260 Ac-D-Phe-Leu-Lys-Ile-Ile-Trp::CHEMBL431218
SMILES CC[C@H](C)[C@H](NC(=O)[C@@H](NC(=O)[C@H](CCCCN)NC(=O)[C@H](CC(C)C)NC(=O)[C@@H](Cc1ccccc1)NC(C)=O)[C@@H](C)CC)C(=O)N[C@@H](Cc1c[nH]c2ccccc12)C(O)=O
InChI Key InChIKey=DYCJTRVZUAXNDM-POHSHLOQSA-N
Data  3 IC50
  Tab Delimited (TSV)   2D SDfile   Computed 3D by Vconf -m prep SDfile
Find this compound or compounds like it in BindingDB:
Activity Spreadsheet -- Enzyme Inhibition Constant Data from BindingDB
Found 3 hits for monomerid = 50045260
TargetEndothelin-1 receptor(Homo sapiens (Human))
Warner-Lambert
Curated by ChEMBL
LigandPNGBDBM50045260(Ac-D-Phe-Leu-Lys-Ile-Ile-Trp | CHEMBL431218)
Affinity DataIC50: >1.00E+4nM. Assay description: Binding affinity against ET A receptor from rabbit renal artery vascular smooth muscle cells
In DepthDetails ArticlePubMed
TargetEndothelin receptor type B/1 receptor(RAT)
Warner-Lambert
Curated by ChEMBL
LigandPNGBDBM50045260(Ac-D-Phe-Leu-Lys-Ile-Ile-Trp | CHEMBL431218)
Affinity DataIC50:  1.20E+4nM. Assay description: Binding affinity against Endothelin receptor from rat heart ventricle
In DepthDetails ArticlePubMed
TargetEndothelin receptor type B(RAT)
Warner-Lambert
Curated by ChEMBL
LigandPNGBDBM50045260(Ac-D-Phe-Leu-Lys-Ile-Ile-Trp | CHEMBL431218)
Affinity DataIC50: >1.00E+4nM. Assay description: Effective concentration against Endothelin B receptor from rat cerebellum
In DepthDetails ArticlePubMed