BDBM50045300 CHEMBL3310840
SMILES COc1nc2[nH]c(=O)[nH]c2cc1NS(=O)(=O)c1cccc(Cl)c1Cl
InChI Key InChIKey=QSVQNPOYGWSGNM-UHFFFAOYSA-N
Data  1 IC50
  Tab Delimited (TSV)   2D SDfile   Computed 3D by Vconf -m prep SDfile
Find this compound or compounds like it in BindingDB:
Activity Spreadsheet -- Enzyme Inhibition Constant Data from BindingDB
Found 1 hit for monomerid = 50045300
TargetC-C chemokine receptor type 4(Homo sapiens (Human))
Glaxosmithkline
Curated by ChEMBL
LigandPNGBDBM50045300(CHEMBL3310840)
Affinity DataIC50:  79nM. Assay description: Antagonist activity at human CCR4 expressed in CHO cell membranes by [35S]-GTPgammaS radioligand competition assay
In DepthDetails ArticlePubMed