BDBM50045447 CHEMBL3309794
SMILES Cc1ccc(\C=C\C(=N/Nc2ccccc2)\c2ccccc2)cc1
InChI Key InChIKey=VFQQXYGTIDGKAW-KOARNGDQSA-N
Data  2 KI
  Tab Delimited (TSV)   2D SDfile   Computed 3D by Vconf -m prep SDfile
Find this compound or compounds like it in BindingDB:
Activity Spreadsheet -- Enzyme Inhibition Constant Data from BindingDB
Found 2 hits for monomerid = 50045447
TargetCathepsin H(Capra hircus (Goat))
Kurukshetra University
Curated by ChEMBL
LigandPNGBDBM50045447(CHEMBL3309794)
Affinity DataKi:  2.91E+3nM. Assay description: Competitive inhibition of goat liver cathepsin H using Leu-betaNA substrate by Lineweaver-Burk plot analysis
In DepthDetails ArticlePubMed
TargetCathepsin B(Capra hircus (Goat))
Kurukshetra University
Curated by ChEMBL
LigandPNGBDBM50045447(CHEMBL3309794)
Affinity DataKi:  3.15E+3nM. Assay description: Competitive inhibition of goat liver cathepsin B using BANA substrate by Lineweaver-Burk plot analysis
In DepthDetails ArticlePubMed