BDBM50045456 CHEMBL1209128
SMILES CC(=O)N1N=C(CC1c1ccc(Br)cc1)c1ccccc1
InChI Key InChIKey=BXDBQMKCMZBKFJ-UHFFFAOYSA-N
Data  2 KI
  Tab Delimited (TSV)   2D SDfile   Computed 3D by Vconf -m prep SDfile
Find this compound or compounds like it in BindingDB:
Activity Spreadsheet -- Enzyme Inhibition Constant Data from BindingDB
Found 2 hits for monomerid = 50045456
TargetCathepsin H(Capra hircus (Goat))
Kurukshetra University
Curated by ChEMBL
LigandPNGBDBM50045456(CHEMBL1209128)
Affinity DataKi:  1.27E+4nM. Assay description: Non-competitive inhibition of goat liver cathepsin H using Leu-betaNA substrate by Lineweaver-Burk plot analysis
In DepthDetails ArticlePubMed
TargetCathepsin B(Capra hircus (Goat))
Kurukshetra University
Curated by ChEMBL
LigandPNGBDBM50045456(CHEMBL1209128)
Affinity DataKi:  6.71E+4nM. Assay description: Non-competitive inhibition of goat liver cathepsin B using BANA substrate by Lineweaver-Burk plot analysis
In DepthDetails ArticlePubMed