BDBM50045549 CHEMBL3311370
SMILES [H][C@@]1(CC[C@@]2([H])[C@]3([H])CC=C4C[C@H](CC[C@]4(C)[C@@]3([H])CC[C@]12C)OCC(=O)N(CC)CC)[C@H](C)CCCC(C)(C)O
InChI Key InChIKey=FFSNFPDMGXMKSK-ACBDEFBISA-N
Data  1 EC50
  Tab Delimited (TSV)   2D SDfile   Computed 3D by Vconf -m prep SDfile
Find this compound or compounds like it in BindingDB:
Activity Spreadsheet -- Enzyme Inhibition Constant Data from BindingDB
Found 1 hit for monomerid = 50045549
TargetNPC1-like intracellular cholesterol transporter 1(Homo sapiens (Human))
The University Of Tokyo
Curated by ChEMBL
LigandPNGBDBM50045549(CHEMBL3311370)
Affinity DataEC50:  4.80E+3nM. Assay description: Binding affinity to FLAG/tGFP-tagged NPC1 I1061T mutant (unknown origin) expressed in HEK293 cells assessed as localization after 24 hrs by fluoresce...
In DepthDetails ArticlePubMed