BDBM50045552 7-OXOCHOLESTEROL::CHEBI:64294
SMILES [H][C@@]1(CC[C@@]2([H])[C@]3([H])C(=O)C=C4C[C@@H](O)CC[C@]4(C)[C@@]3([H])CC[C@]12C)[C@H](C)CCCC(C)C
InChI Key InChIKey=YIKKMWSQVKJCOP-ABXCMAEBSA-N
Data  1 EC50
PDB links: 2 PDB IDs match this monomer.
  Tab Delimited (TSV)   2D SDfile   Computed 3D by Vconf -m prep SDfile
Find this compound or compounds like it in BindingDB:
Activity Spreadsheet -- Enzyme Inhibition Constant Data from BindingDB
Found 1 hit for monomerid = 50045552
TargetNPC1-like intracellular cholesterol transporter 1(Homo sapiens (Human))
The University Of Tokyo
Curated by ChEMBL
LigandPNGBDBM50045552(7-OXOCHOLESTEROL | CHEBI:64294)
Affinity DataEC50:  8.70E+3nM. Assay description: Binding affinity to FLAG/tGFP-tagged NPC1 I1061T mutant (unknown origin) expressed in HEK293 cells assessed as localization after 24 hrs by fluoresce...
In DepthDetails ArticlePubMed