BDBM50045554 CHEMBL3311501
SMILES [H][C@@]1(CC[C@@]2([H])[C@]3([H])C[C@@H](O)[C@@]4(O)C[C@H](CC[C@]4(C)[C@@]3([H])CC[C@]12C)OCC(=O)N1CCOCC1)[C@H](C)COc1cc(cc(c1)C(F)(F)F)C(F)(F)F
InChI Key InChIKey=TXIATQUJSWMSID-PZCGZSAMSA-N
Data  1 EC50
  Tab Delimited (TSV)   2D SDfile   Computed 3D by Vconf -m prep SDfile
Find this compound or compounds like it in BindingDB:
Activity Spreadsheet -- Enzyme Inhibition Constant Data from BindingDB
Found 1 hit for monomerid = 50045554
TargetNPC1-like intracellular cholesterol transporter 1(Homo sapiens (Human))
The University Of Tokyo
Curated by ChEMBL
LigandPNGBDBM50045554(CHEMBL3311501)
Affinity DataEC50: >1.00E+4nM. Assay description: Binding affinity to FLAG/tGFP-tagged NPC1 I1061T mutant (unknown origin) expressed in HEK293 cells assessed as localization after 24 hrs by fluoresce...
In DepthDetails ArticlePubMed