BDBM50045653 3-[1-(4-Chloro-benzyl)-4-methyl-6-(6-phenyl-pyridin-2-ylmethoxy)-4,5-dihydro-1H-3-thia-1-aza-acenaphthylen-2-yl]-2,2-dimethyl-propionic acid::CHEMBL317482
SMILES CC1Cc2c(OCc3cccc(n3)-c3ccccc3)ccc3n(Cc4ccc(Cl)cc4)c(CC(C)(C)C(O)=O)c(S1)c23
InChI Key InChIKey=SYQXGAHLSODHJW-UHFFFAOYSA-N
Data  2 IC50
  Tab Delimited (TSV)   2D SDfile   Computed 3D by Vconf -m prep SDfile
Find this compound or compounds like it in BindingDB:
Activity Spreadsheet -- Enzyme Inhibition Constant Data from BindingDB
Found 2 hits for monomerid = 50045653
TargetPolyunsaturated fatty acid 5-lipoxygenase(Homo sapiens (Human))
Merck Frosst Centre For Therapeutic Research
Curated by ChEMBL
LigandPNGBDBM50045653(3-[1-(4-Chloro-benzyl)-4-methyl-6-(6-phenyl-pyridi...)
Affinity DataIC50:  27nM. Assay description: In vitro inhibition of LTB4 biosynthesis in [Ca2+]-ionophore-activated human polymorphonuclear leukocytes
In DepthDetails ArticlePubMed
TargetPolyunsaturated fatty acid 5-lipoxygenase(Rattus norvegicus)
Merck Frosst Centre For Therapeutic Research
Curated by ChEMBL
LigandPNGBDBM50045653(3-[1-(4-Chloro-benzyl)-4-methyl-6-(6-phenyl-pyridi...)
Affinity DataIC50:  2.50E+3nM. Assay description: In vitro test for inhibition of 5-lipoxygenase in cell-free preparations from rat PMN leukocytes
In DepthDetails ArticlePubMed