BDBM50045655 3-[1-(4-Chloro-benzyl)-4-methyl-3,3-dioxo-6-(5-phenyl-pyridin-2-ylmethoxy)-1,3,4,5-tetrahydro-3lambda*6*-thia-1-aza-acenaphthylen-2-yl]-2,2-dimethyl-propionic acid::CHEMBL319951
SMILES CC1Cc2c(OCc3ccc(cn3)-c3ccccc3)ccc3n(Cc4ccc(Cl)cc4)c(CC(C)(C)C(O)=O)c(c23)S1(=O)=O
InChI Key InChIKey=NLMNEVIHJVRDCQ-UHFFFAOYSA-N
Data  2 IC50
  Tab Delimited (TSV)   2D SDfile   Computed 3D by Vconf -m prep SDfile
Find this compound or compounds like it in BindingDB:
Activity Spreadsheet -- Enzyme Inhibition Constant Data from BindingDB
Found 2 hits for monomerid = 50045655
TargetPolyunsaturated fatty acid 5-lipoxygenase(Rattus norvegicus)
Merck Frosst Centre For Therapeutic Research
Curated by ChEMBL
LigandPNGBDBM50045655(3-[1-(4-Chloro-benzyl)-4-methyl-3,3-dioxo-6-(5-phe...)
Affinity DataIC50:  320nM. Assay description: In vitro test for inhibition of 5-lipoxygenase in cell-free preparations from rat PMN leukocytes
In DepthDetails ArticlePubMed
TargetPolyunsaturated fatty acid 5-lipoxygenase(Homo sapiens (Human))
Merck Frosst Centre For Therapeutic Research
Curated by ChEMBL
LigandPNGBDBM50045655(3-[1-(4-Chloro-benzyl)-4-methyl-3,3-dioxo-6-(5-phe...)
Affinity DataIC50:  210nM. Assay description: In vitro inhibition of LTB4 biosynthesis in [Ca2+]-ionophore-activated human polymorphonuclear leukocytes
In DepthDetails ArticlePubMed