BDBM50045699 CHEMBL3309832
SMILES Cc1ccc(cc1)S(=O)(=O)N1N=C(CC1c1cccc2OCOc12)C(F)(F)F
InChI Key InChIKey=YGFVMPRTUQKSCQ-UHFFFAOYSA-N
Data  2 IC50
  Tab Delimited (TSV)   2D SDfile   Computed 3D by Vconf -m prep SDfile
Find this compound or compounds like it in BindingDB:
Activity Spreadsheet -- Enzyme Inhibition Constant Data from BindingDB
Found 2 hits for monomerid = 50045699
TargetProstaglandin G/H synthase 1(Homo sapiens (Human))
Second Affiliated Hospital Of Southeast University
Curated by ChEMBL
LigandPNGBDBM50045699(CHEMBL3309832)
Affinity DataIC50:  1.04E+4nM. Assay description: Inhibition of COX1 (unknown origin) by solid phase ELISA method
In DepthDetails ArticlePubMed
TargetProstaglandin G/H synthase 2(Homo sapiens (Human))
Second Affiliated Hospital Of Southeast University
Curated by ChEMBL
LigandPNGBDBM50045699(CHEMBL3309832)
Affinity DataIC50:  5.74E+4nM. Assay description: Inhibition of COX2 (unknown origin) by solid phase ELISA method
In DepthDetails ArticlePubMed