BDBM50045926 3-[2-(3-hydroxyphenyl)-(E)-1-ethenyl]phenol::CHEMBL100016
SMILES Oc1cccc(\C=C\c2cccc(O)c2)c1
InChI Key InChIKey=VLOHFQFIKQIMBT-BQYQJAHWSA-N
Data  1 IC50
  Tab Delimited (TSV)   2D SDfile   Computed 3D by Vconf -m prep SDfile
Find this compound or compounds like it in BindingDB:
Activity Spreadsheet -- Enzyme Inhibition Constant Data from BindingDB
Found 1 hit for monomerid = 50045926
TargetTyrosine-protein kinase Lck(Homo sapiens (Human))
Purdue University
Curated by ChEMBL
LigandPNGBDBM50045926(3-[2-(3-hydroxyphenyl)-(E)-1-ethenyl]phenol | CHEM...)
Affinity DataIC50:  2.34E+5nM. Assay description: Tested in vitro for the inhibition of protein-tyrosine kinase p56lck using angiotensin I (1.2 mM) and [gamma-32P]-ATP (50 pM)
In DepthDetails ArticlePubMed