BDBM50045965 CHEMBL265057::N-(3-{4-[Cyano-(2-methyl-pyridin-3-yl)-methyl]-piperazin-1-yl}-3-oxo-1-phenyl-propyl)-methanesulfonamide
SMILES Cc1ncccc1C(C#N)N1CCN(CC1)C(=O)CC(NS(C)(=O)=O)c1ccccc1
InChI Key InChIKey=VOIPBAABJQZHKE-UHFFFAOYSA-N
Data  1 IC50
  Tab Delimited (TSV)   2D SDfile   Computed 3D by Vconf -m prep SDfile
Find this compound or compounds like it in BindingDB:
Activity Spreadsheet -- Enzyme Inhibition Constant Data from BindingDB
Found 1 hit for monomerid = 50045965
TargetPlatelet-activating factor receptor(Cavia porcellus)
J. Uriach & CíA.
Curated by ChEMBL
LigandPNGBDBM50045965(CHEMBL265057 | N-(3-{4-[Cyano-(2-methyl-pyridin-3-...)
Affinity DataIC50:  21nM. Assay description: In vitro inhibition of PAF-induced platelet aggregation in male rabbits
In DepthDetails ArticlePubMed