BDBM50045967 (2-Methyl-pyridin-3-yl)-{4-[3-(2-oxo-pyrrolidin-1-yl)-3-phenyl-propionyl]-piperazin-1-yl}-acetonitrile::CHEMBL100190
SMILES Cc1ncccc1C(C#N)N1CCN(CC1)C(=O)CC(N1CCCC1=O)c1ccccc1
InChI Key InChIKey=DJFOZVOJJFSISR-UHFFFAOYSA-N
Data  1 IC50
  Tab Delimited (TSV)   2D SDfile   Computed 3D by Vconf -m prep SDfile
Find this compound or compounds like it in BindingDB:
Activity Spreadsheet -- Enzyme Inhibition Constant Data from BindingDB
Found 1 hit for monomerid = 50045967
TargetPlatelet-activating factor receptor(Cavia porcellus)
J. Uriach & CíA.
Curated by ChEMBL
LigandPNGBDBM50045967((2-Methyl-pyridin-3-yl)-{4-[3-(2-oxo-pyrrolidin-1-...)
Affinity DataIC50:  30nM. Assay description: Inhibition of PAF-induced platelet aggregation
In DepthDetails ArticlePubMed