BDBM50045985 (2-Methyl-pyridin-3-yl)-(4-{3-phenyl-3-[(pyridin-3-ylmethyl)-amino]-propionyl}-piperazin-1-yl)-acetonitrile::CHEMBL319960
SMILES Cc1ncccc1C(C#N)N1CCN(CC1)C(=O)CC(NCc1cccnc1)c1ccccc1
InChI Key InChIKey=PMMLUTDXOLETKM-UHFFFAOYSA-N
Data  1 IC50
  Tab Delimited (TSV)   2D SDfile   Computed 3D by Vconf -m prep SDfile
Find this compound or compounds like it in BindingDB:
Activity Spreadsheet -- Enzyme Inhibition Constant Data from BindingDB
Found 1 hit for monomerid = 50045985
TargetPlatelet-activating factor receptor(Cavia porcellus)
J. Uriach & CíA.
Curated by ChEMBL
LigandPNGBDBM50045985((2-Methyl-pyridin-3-yl)-(4-{3-phenyl-3-[(pyridin-3...)
Affinity DataIC50:  75nM. Assay description: Inhibition of PAF-induced platelet aggregation
In DepthDetails ArticlePubMed